Error compiling spatial-solr-sandbox

classic Classic list List threaded Threaded
3 messages Options
Reply | Threaded
Open this post in threaded view
|

Error compiling spatial-solr-sandbox

wulfgarpro
When I compile the project I get an error building the LSE module:

[INFO] Compiling 7 source files to C:\Users\..\Desktop\spatial-solr-sandbox-master\LSE\target\classes
[INFO] -------------------------------------------------------------
[ERROR] COMPILATION ERROR :
[INFO] -------------------------------------------------------------
[ERROR] \Users\..\Desktop\spatial-solr-sandbox-master\LSE\src\main\java\org\apache\lucene\spatial\pending\jts\JtsGeoStrategy.java:[27,33] cannot find symbol
symbol  : class DerefBytesDocValuesField
location: package org.apache.lucene.document
[ERROR] \Users\..\Desktop\spatial-solr-sandbox-master\LSE\src\main\java\org\apache\lucene\spatial\pending\jts\GeometryOperationFilter.java:[23,30] cannot find symbol
symbol  : class DocValues
location: package org.apache.lucene.index
[ERROR] \Users\..\Desktop\spatial-solr-sandbox-master\LSE\src\main\java\org\apache\lucene\spatial\pending\jts\GeometryOperationFilter.java:[24,40] package org.apache.lucene.index.DocValues does not exist
[ERROR] \Users\..\Desktop\spatial-solr-sandbox-master\LSE\src\main\java\org\apache\lucene\spatial\pending\jts\JtsGeoStrategy.java:[80,27] cannot find symbol
symbol  : class DerefBytesDocValuesField
location: class org.apache.lucene.spatial.pending.jts.JtsGeoStrategy
[ERROR] \Users\..\Desktop\spatial-solr-sandbox-master\LSE\src\main\java\org\apache\lucene\spatial\pending\jts\GeometryOperationFilter.java:[64,4] cannot find symbol
symbol  : class DocValues
location: class org.apache.lucene.spatial.pending.jts.GeometryOperationFilter
[ERROR] \Users\..\Desktop\spatial-solr-sandbox-master\LSE\src\main\java\org\apache\lucene\spatial\pending\jts\GeometryOperationFilter.java:[64,28] cannot find symbol
symbol  : method docValues(java.lang.String)
location: class org.apache.lucene.index.AtomicReader
[ERROR] \Users\..\Desktop\spatial-solr-sandbox-master\LSE\src\main\java\org\apache\lucene\spatial\pending\jts\GeometryOperationFilter.java:[65,4] cannot find symbol
symbol  : class Source
location: class org.apache.lucene.spatial.pending.jts.GeometryOperationFilter
[INFO] 7 errors
[INFO] -------------------------------------------------------------
[INFO] ------------------------------------------------------------------------
[INFO] Reactor Summary:
[INFO]
[INFO] Lucene Spatial Extensions ......................... FAILURE [1.469s]
[INFO] Lucene Solr Spatial - Demo ........................ SKIPPED
[INFO] ------------------------------------------------------------------------
[INFO] BUILD FAILURE
[INFO] ------------------------------------------------------------------------
[INFO] Total time: 1.588s
[INFO] Finished at: Wed Mar 13 14:13:46 CST 2013
[INFO] Final Memory: 12M/489M
[INFO] ------------------------------------------------------------------------

Any help would be appreciated.
Reply | Threaded
Open this post in threaded view
|

Re: [Dev] Error compiling spatial-solr-sandbox

dsmiley
Hi,
That's probably related to the fact that the DocValues API changed in Lucene 4.2.  Maybe Ryan will update the affected strategy; not sure.  I view JtsGeoStrategy as more of a proof of concept.
~ David


On Tue, Mar 12, 2013 at 11:49 PM, wulfgarpro <[hidden email]> wrote:
When I compile the project I get an error building the LSE module:

[INFO] Compiling 7 source files to
C:\Users\..\Desktop\spatial-solr-sandbox-master\LSE\target\classes
[INFO] -------------------------------------------------------------
[ERROR] COMPILATION ERROR :
[INFO] -------------------------------------------------------------
[ERROR]
\Users\..\Desktop\spatial-solr-sandbox-master\LSE\src\main\java\org\apache\lucene\spatial\pending\jts\JtsGeoStrategy.java:[27,33]
cannot find symbol
symbol  : class DerefBytesDocValuesField
location: package org.apache.lucene.document
[ERROR]
\Users\..\Desktop\spatial-solr-sandbox-master\LSE\src\main\java\org\apache\lucene\spatial\pending\jts\GeometryOperationFilter.java:[23,30]
cannot find symbol
symbol  : class DocValues
location: package org.apache.lucene.index
[ERROR]
\Users\..\Desktop\spatial-solr-sandbox-master\LSE\src\main\java\org\apache\lucene\spatial\pending\jts\GeometryOperationFilter.java:[24,40]
package org.apache.lucene.index.DocValues does not exist
[ERROR]
\Users\..\Desktop\spatial-solr-sandbox-master\LSE\src\main\java\org\apache\lucene\spatial\pending\jts\JtsGeoStrategy.java:[80,27]
cannot find symbol
symbol  : class DerefBytesDocValuesField
location: class org.apache.lucene.spatial.pending.jts.JtsGeoStrategy
[ERROR]
\Users\..\Desktop\spatial-solr-sandbox-master\LSE\src\main\java\org\apache\lucene\spatial\pending\jts\GeometryOperationFilter.java:[64,4]
cannot find symbol
symbol  : class DocValues
location: class
org.apache.lucene.spatial.pending.jts.GeometryOperationFilter
[ERROR]
\Users\..\Desktop\spatial-solr-sandbox-master\LSE\src\main\java\org\apache\lucene\spatial\pending\jts\GeometryOperationFilter.java:[64,28]
cannot find symbol
symbol  : method docValues(java.lang.String)
location: class org.apache.lucene.index.AtomicReader
[ERROR]
\Users\..\Desktop\spatial-solr-sandbox-master\LSE\src\main\java\org\apache\lucene\spatial\pending\jts\GeometryOperationFilter.java:[65,4]
cannot find symbol
symbol  : class Source
location: class
org.apache.lucene.spatial.pending.jts.GeometryOperationFilter
[INFO] 7 errors
[INFO] -------------------------------------------------------------
[INFO]
------------------------------------------------------------------------
[INFO] Reactor Summary:
[INFO]
[INFO] Lucene Spatial Extensions ......................... FAILURE [1.469s]
[INFO] Lucene Solr Spatial - Demo ........................ SKIPPED
[INFO]
------------------------------------------------------------------------
[INFO] BUILD FAILURE
[INFO]
------------------------------------------------------------------------
[INFO] Total time: 1.588s
[INFO] Finished at: Wed Mar 13 14:13:46 CST 2013
[INFO] Final Memory: 12M/489M
[INFO]
------------------------------------------------------------------------

Any help would be appreciated.



--
View this message in context: http://spatial4j.16575.n6.nabble.com/Error-compiling-spatial-solr-sandbox-tp5001142.html
Sent from the Spatial4j mailing list archive at Nabble.com.
_______________________________________________
dev mailing list
[hidden email]
http://lists.spatial4j.com/listinfo.cgi/dev-spatial4j.com


_______________________________________________
dev mailing list
[hidden email]
http://lists.spatial4j.com/listinfo.cgi/dev-spatial4j.com
Reply | Threaded
Open this post in threaded view
|

Re: Error compiling spatial-solr-sandbox

diemei
This post has NOT been accepted by the mailing list yet.
In reply to this post by wulfgarpro
Toms Shoes sale, actualization with absorption to less! Walk aerial this year and admire a set of adorable top heel shoes for that adapted day or girl's authentic date, platforms, wedges as able as apparent night sandals to accomplish your ensemble. For 9 until 5 acquire affluence as able as actualization with a set of brogues or even aigrette loafers, activated and complete cool, canonizing those close and aerial times. There are different toms classic free shipping cossack readily attainable for all of you to baddest from. No bulk what you would like, you can accretion brace of Toms attainable for you. They board Toms Archetypal Shoes, Toms Glitters Shoes, etc. To ensure that everybody could possibly get their adapted brace of Toms shoes